{"text_format":"1","workbook":"xlsx","n_sheets":7,"sheets":["SETUP","BANK","CASH&MJ","WAGES","PL","BAS","BS"],"not_rendered":{"charts":0,"images":1,"macros":0,"external_links":0,"defined_names":11,"comments":0,"pivot_tables":0},"unopened":[],"bounds":{"document_bytes":16777216,"sheet_cells":100000,"rows_first":2000,"rows_last":500,"rows_between":2000,"halvings":0,"cell_chars":16384,"cell_head_chars":4096},"cells_cut":0,"cells_raw":0,"read":"whole","date_system":"1900"}

{"sheet":"SETUP","index":0,"n_rows":58,"n_cols":10,"rows_kept":58,"cut":false,"hidden":false,"merged":[[38,6,38,7],[38,8,38,9],[2,1,2,2],[3,1,3,2],[4,1,4,2],[5,1,5,2]]}
[{"$f":"B3","v":"ABC PTY LTD"}]
["Setup"]
["Legal Name","ABC PTY LTD",null,"Start Date"]
["ABN","88 888 888 888",null,"2025-07-01"]
["GST Status","Registered from 21 Mar 2026",null,"End Date"]
["Reporting Year","FY2026",null,"2026-06-30","Prepared by Tako Accountant Services Pty Ltd"]
[null,null,null,null,"admin@takoaccountant.com.au"]
["Trial Balance & Chart of Accounts",null,null,null,"Phone:(07) 3157 3207"]
{"$rows_left_out":51}
{"sheet":"BANK","index":1,"n_rows":1443,"n_cols":14,"rows_kept":1443,"cut":false,"hidden":false,"merged":[]}
[{"$f":"SETUP!B3","v":"ABC PTY LTD"},null,null,null,"Reconciliation Report"]
["Income & Expenses & Other Payments From Bank statement/CSV",null,null,null,"Statement Amount ","BANK-A","BANK-B","Bookkeeping","Difference"]
["1.下载银行对账单CSV格式，复制日期、金额、描述到ABC三列，输入期初金额到F3或F4格中.",null,null,"Start Date",{"$f":"SETUP!D4","v":"2025-07-01"},null,null,{"$f":"F3+G3","v":0},{"$f":"F3+G3-H3","v":0}]
["2.每季度结束日银行账户余额必须和这里excel的金额一致。",null,null,null,"Cash In",{"$f":"SUMPRODUCT((B10:B1445>0)*(D10:D1445=F2),B10:B1445)","v":0},{"$f":"SUMPRODUCT((B10:B1445>0)*(D10:D1445=G2),B10:B1445)","v":0},{"$f":"SUMIF(I10:I1445,\">0\",I10:I1445)","v":0},{"$f":"F4+G4-H4","v":0}]
["3.E列下拉菜单，选择NG-没GST，GC-收入GST，GP-支出GST，如果和发票GST金额不一致，手动输入正确GST金额。",null,null,null,"Cash Out",{"$f":"SUMPRODUCT((B10:B1445<0)*(D10:D1445=F2),B10:B1445)","v":0},{"$f":"SUMPRODUCT((B10:B1445<0)*(D10:D1445=G2),B10:B1445)","v":0},{"$f":"SUMIF(I10:I1445,\"<0\",I10:I1445)","v":0},0]
["4.科目选择参考SETUP中的科目类别，在F列下拉菜单选择科目.",null,null,"End Date",{"$f":"SETUP!D6","v":"2026-06-30"},{"$f":"SUM(F3:F5)","v":0},{"$f":"SUM(G3:G5)","v":0},{"$f":"SUM(H3:H5)","v":0},0]
["5.支出一律用负值格式输入，如”-100“，GST金额也要对应负值。收入一律正值输入。"]
["Cash Basis",{"$f":"SUM(B10:B1442)","v":0},null,null,null,null,{"$f":"SUM(G10:G1442)","v":0},{"$f":"SUM(H10:H1442)","v":0},{"$f":"SUM(I10:I1442)","v":0}]
{"$rows_left_out":1436}
{"sheet":"CASH&MJ","index":2,"n_rows":624,"n_cols":14,"rows_kept":624,"cut":false,"hidden":false,"merged":[]}
[{"$f":"SETUP!B3","v":"ABC PTY LTD"}]
["Income & Expenses from Cash/Personal bank/Staff Claim and all Manual Entry such as Depreciatipon"]
["所有现金收入和现金支出填入此表，如员工垫付的费用报销入账，必须凭发票方可入帐",null,null,null,null,null,null,"Cash",{"$f":"SUMIF(D:D,H3,I:I)","v":0}]
["1.时间上要以发票时间为准。上个季度没有及时入账的，在本季度入账的时间统一写成这个季度的第一天。",null,null,null,null,null,null,"MJ",{"$f":"SUMIF(D:D,H4,I:I)","v":0}]
["2.E列下拉菜单，选择NG-没GST，GC-收入GST，GP-支出GST，如果和发票GST金额不一致，手动输入正确GST金额。"]
["3.科目选择参考SETUP中的科目类别，在F列下拉菜单选择科目."]
["4.支出一律用负值格式输入，如”-100“，GST金额也要对应负值。收入一律正值输入。"]
["Cash Basis",{"$f":"SUM(B10:B887)","v":0},null,null,null,null,{"$f":"SUM(G10:G887)","v":0},{"$f":"SUM(H10:H887)","v":0},{"$f":"SUM(I10:I887)","v":0}]
{"$rows_left_out":617}
{"sheet":"WAGES","index":3,"n_rows":132,"n_cols":8,"rows_kept":132,"cut":false,"hidden":false,"merged":[]}
[{"$f":"SETUP!B3","v":"ABC PTY LTD"},null,null,null,null,null,null,"Super Rate"]
["Wages From Single Touch Payroll",null,null,null,null,null,null,0.12]
["来自工资系统的员工工资数据",null,null,null,null,null,null,"请手动填入当年养老金百分比率"]
["填写方法："]
["1.从Single Touch Payroll系统里，提取四个重要数据（Payment Date，Name，Gross Wages和PAYG-Tax）手工填写到以上表格中"]
["2.每个新的季度在原先的基础上，继续往下做，不要删除任何数据，直到财年结束日6月30日"]
[]
["SUMMARY","EMPLOYEE","Gross Wages","PAYG-TAX","Net Wages","Super"]
{"$rows_left_out":125}
{"sheet":"PL","index":4,"n_rows":33,"n_cols":17,"rows_kept":33,"cut":false,"hidden":false,"merged":[]}
[null,{"$f":"SETUP!B3","v":"ABC PTY LTD"}]
[null,"Profit and Loss Statement"]
[]
[null,"Cash Basis",{"$f":"SETUP!B6","v":"FY2026"},{"$f":"BANK!E3","v":"2025-07-01"},{"$f":"D4+31","v":"2025-08-01"},{"$f":"E4+31","v":"2025-09-01"},"2025-10-02","2025-11-02","2025-12-03","2026-01-03","2026-02-03","2026-03-06","2026-04-06","2026-05-07","2026-06-07",null,"Checking"]
[null,"Income"]
[null,{"$f":"SETUP!B12","v":"Sales"},{"$f":"SUM(D6:O6)","v":0},{"$f":"SUMPRODUCT((BANK!$F$10:$F$1447=$B6)*(MONTH(BANK!$A$10:$A$1447)=MONTH(PL!D$4))*(YEAR(BANK!$A$10:$A$1447)=YEAR(PL!D$4)),BANK!$H$10:$H$1447)+SUMPRODUCT(('CASH&MJ'!$F$10:$F$1002=$B6)*(MONTH('CASH&MJ'!$A$10:$A$1002)=MONTH(PL!D$4))*(YEAR('CASH&MJ'!$A$10:$A$1002)=YEAR(PL!D$4)),'CASH&MJ'!$H$10:$H$1002)","v":0},{"$f":"SUMPRODUCT((BANK!$F$10:$F$1447=$B6)*(MONTH(BANK!$A$10:$A$1447)=MONTH(PL!E$4))*(YEAR(BANK!$A$10:$A$1447)=YEAR(PL!E$4)),BANK!$H$10:$H$1447)+SUMPRODUCT(('CASH&MJ'!$F$10:$F$1002=$B6)*(MONTH('CASH&MJ'!$A$10:$A$1002)=MONTH(PL!E$4))*(YEAR('CASH&MJ'!$A$10:$A$1002)=YEAR(PL!E$4)),'CASH&MJ'!$H$10:$H$1002)","v":0},{"$f":"SUMPRODUCT((BANK!$F$10:$F$1447=$B6)*(MONTH(BANK!$A$10:$A$1447)=MONTH(PL!F$4))*(YEAR(BANK!$A$10:$A$1447)=YEAR(PL!F$4)),BANK!$H$10:$H$1447)+SUMPRODUCT(('CASH&MJ'!$F$10:$F$1002=$B6)*(MONTH('CASH&MJ'!$A$10:$A$1002)=MONTH(PL!F$4))*(YEAR('CASH&MJ'!$A$10:$A$1002)=YEAR(PL!F$4)),'CASH&MJ'!$H$10:$H$1002)","v":0},{"$f":"SUMPRODUCT((BANK!$F$10:$F$1447=$B6)*(MONTH(BANK!$A$10:$A$1447)=MONTH(PL!G$4))*(YEAR(BANK!$A$10:$A$1447)=YEAR(PL!G$4)),BANK!$H$10:$H$1447)+SUMPRODUCT(('CASH&MJ'!$F$10:$F$1002=$B6)*(MONTH('CASH&MJ'!$A$10:$A$1002)=MONTH(PL!G$4))*(YEAR('CASH&MJ'!$A$10:$A$1002)=YEAR(PL!G$4)),'CASH&MJ'!$H$10:$H$1002)","v":0},{"$f":"SUMPRODUCT((BANK!$F$10:$F$1447=$B6)*(MONTH(BANK!$A$10:$A$1447)=MONTH(PL!H$4))*(YEAR(BANK!$A$10:$A$1447)=YEAR(PL!H$4)),BANK!$H$10:$H$1447)+SUMPRODUCT(('CASH&MJ'!$F$10:$F$1002=$B6)*(MONTH('CASH&MJ'!$A$10:$A$1002)=MONTH(PL!H$4))*(YEAR('CASH&MJ'!$A$10:$A$1002)=YEAR(PL!H$4)),'CASH&MJ'!$H$10:$H$1002)","v":0},{"$f":"SUMPRODUCT((BANK!$F$10:$F$1447=$B6)*(MONTH(BANK!$A$10:$A$1447)=MONTH(PL!I$4))*(YEAR(BANK!$A$10:$A$1447)=YEAR(PL!I$4)),BANK!$H$10:$H$1447)+SUMPRODUCT(('CASH&MJ'!$F$10:$F$1002=$B6)*(MONTH('CASH&MJ'!$A$10:$A$1002)=MONTH(PL!I$4))*(YEAR('CASH&MJ'!$A$10:$A$1002)=YEAR(PL!I$4)),'CASH&MJ'!$H$10:$H$1002)","v":0},{"$f":"SUMPRODUCT((BANK!$F$10:$F$1447=$B6)*(MONTH(BANK!$A$10:$A$1447)=MONTH(PL!J$4))*(YEAR(BANK!$A$10:$A$1447)=YEAR(PL!J$4)),BANK!$H$10:$H$1447)+SUMPRODUCT(('CASH&MJ'!$F$10:$F$1002=$B6)*(MONTH('CASH&MJ'!$A$10:$A$1002)=MONTH(PL!J$4))*(YEAR('CASH&MJ'!$A$10:$A$1002)=YEAR(PL!J$4)),'CASH&MJ'!$H$10:$H$1002)","v":0},{"$f":"SUMPRODUCT((BANK!$F$10:$F$1447=$B6)*(MONTH(BANK!$A$10:$A$1447)=MONTH(PL!K$4))*(YEAR(BANK!$A$10:$A$1447)=YEAR(PL!K$4)),BANK!$H$10:$H$1447)+SUMPRODUCT(('CASH&MJ'!$F$10:$F$1002=$B6)*(MONTH('CASH&MJ'!$A$10:$A$1002)=MONTH(PL!K$4))*(YEAR('CASH&MJ'!$A$10:$A$1002)=YEAR(PL!K$4)),'CASH&MJ'!$H$10:$H$1002)","v":0},{"$f":"SUMPRODUCT((BANK!$F$10:$F$1447=$B6)*(MONTH(BANK!$A$10:$A$1447)=MONTH(PL!L$4))*(YEAR(BANK!$A$10:$A$1447)=YEAR(PL!L$4)),BANK!$H$10:$H$1447)+SUMPRODUCT(('CASH&MJ'!$F$10:$F$1002=$B6)*(MONTH('CASH&MJ'!$A$10:$A$1002)=MONTH(PL!L$4))*(YEAR('CASH&MJ'!$A$10:$A$1002)=YEAR(PL!L$4)),'CASH&MJ'!$H$10:$H$1002)","v":0},{"$f":"SUMPRODUCT((BANK!$F$10:$F$1447=$B6)*(MONTH(BANK!$A$10:$A$1447)=MONTH(PL!M$4))*(YEAR(BANK!$A$10:$A$1447)=YEAR(PL!M$4)),BANK!$H$10:$H$1447)+SUMPRODUCT(('CASH&MJ'!$F$10:$F$1002=$B6)*(MONTH('CASH&MJ'!$A$10:$A$1002)=MONTH(PL!M$4))*(YEAR('CASH&MJ'!$A$10:$A$1002)=YEAR(PL!M$4)),'CASH&MJ'!$H$10:$H$1002)","v":0},{"$f":"SUMPRODUCT((BANK!$F$10:$F$1447=$B6)*(MONTH(BANK!$A$10:$A$1447)=MONTH(PL!N$4))*(YEAR(BANK!$A$10:$A$1447)=YEAR(PL!N$4)),BANK!$H$10:$H$1447)+SUMPRODUCT(('CASH&MJ'!$F$10:$F$1002=$B6)*(MONTH('CASH&MJ'!$A$10:$A$1002)=MONTH(PL!N$4))*(YEAR('CASH&MJ'!$A$10:$A$1002)=YEAR(PL!N$4)),'CASH&MJ'!$H$10:$H$1002)","v":0},{"$f":"SUMPRODUCT((BANK!$F$10:$F$1447=$B6)*(MONTH(BANK!$A$10:$A$1447)=MONTH(PL!O$4))*(YEAR(BANK!$A$10:$A$1447)=YEAR(PL!O$4)),BANK!$H$10:$H$1447)+SUMPRODUCT(('CASH&MJ'!$F$10:$F$1002=$B6)*(MONTH('CASH&MJ'!$A$10:$A$1002)=MONTH(PL!O$4))*(YEAR('CASH&MJ'!$A$10:$A$1002)=YEAR(PL!O$4)),'CASH&MJ'!$H$10:$H$1002)","v":0},null,{"$f":"C6-SETUP!D12","v":0}]
[null,{"$f":"SETUP!B13","v":"Interest Income"},{"$f":"SUM(D7:O7)","v":0},{"$f":"SUMPRODUCT((BANK!$F$10:$F$1447=$B7)*(MONTH(BANK!$A$10:$A$1447)=MONTH(PL!D$4))*(YEAR(BANK!$A$10:$A$1447)=YEAR(PL!D$4)),BANK!$H$10:$H$1447)+SUMPRODUCT(('CASH&MJ'!$F$10:$F$1002=$B7)*(MONTH('CASH&MJ'!$A$10:$A$1002)=MONTH(PL!D$4))*(YEAR('CASH&MJ'!$A$10:$A$1002)=YEAR(PL!D$4)),'CASH&MJ'!$H$10:$H$1002)","v":0},{"$f":"SUMPRODUCT((BANK!$F$10:$F$1447=$B7)*(MONTH(BANK!$A$10:$A$1447)=MONTH(PL!E$4))*(YEAR(BANK!$A$10:$A$1447)=YEAR(PL!E$4)),BANK!$H$10:$H$1447)+SUMPRODUCT(('CASH&MJ'!$F$10:$F$1002=$B7)*(MONTH('CASH&MJ'!$A$10:$A$1002)=MONTH(PL!E$4))*(YEAR('CASH&MJ'!$A$10:$A$1002)=YEAR(PL!E$4)),'CASH&MJ'!$H$10:$H$1002)","v":0},{"$f":"SUMPRODUCT((BANK!$F$10:$F$1447=$B7)*(MONTH(BANK!$A$10:$A$1447)=MONTH(PL!F$4))*(YEAR(BANK!$A$10:$A$1447)=YEAR(PL!F$4)),BANK!$H$10:$H$1447)+SUMPRODUCT(('CASH&MJ'!$F$10:$F$1002=$B7)*(MONTH('CASH&MJ'!$A$10:$A$1002)=MONTH(PL!F$4))*(YEAR('CASH&MJ'!$A$10:$A$1002)=YEAR(PL!F$4)),'CASH&MJ'!$H$10:$H$1002)","v":0},{"$f":"SUMPRODUCT((BANK!$F$10:$F$1447=$B7)*(MONTH(BANK!$A$10:$A$1447)=MONTH(PL!G$4))*(YEAR(BANK!$A$10:$A$1447)=YEAR(PL!G$4)),BANK!$H$10:$H$1447)+SUMPRODUCT(('CASH&MJ'!$F$10:$F$1002=$B7)*(MONTH('CASH&MJ'!$A$10:$A$1002)=MONTH(PL!G$4))*(YEAR('CASH&MJ'!$A$10:$A$1002)=YEAR(PL!G$4)),'CASH&MJ'!$H$10:$H$1002)","v":0},{"$f":"SUMPRODUCT((BANK!$F$10:$F$1447=$B7)*(MONTH(BANK!$A$10:$A$1447)=MONTH(PL!H$4))*(YEAR(BANK!$A$10:$A$1447)=YEAR(PL!H$4)),BANK!$H$10:$H$1447)+SUMPRODUCT(('CASH&MJ'!$F$10:$F$1002=$B7)*(MONTH('CASH&MJ'!$A$10:$A$1002)=MONTH(PL!H$4))*(YEAR('CASH&MJ'!$A$10:$A$1002)=YEAR(PL!H$4)),'CASH&MJ'!$H$10:$H$1002)","v":0},{"$f":"SUMPRODUCT((BANK!$F$10:$F$1447=$B7)*(MONTH(BANK!$A$10:$A$1447)=MONTH(PL!I$4))*(YEAR(BANK!$A$10:$A$1447)=YEAR(PL!I$4)),BANK!$H$10:$H$1447)+SUMPRODUCT(('CASH&MJ'!$F$10:$F$1002=$B7)*(MONTH('CASH&MJ'!$A$10:$A$1002)=MONTH(PL!I$4))*(YEAR('CASH&MJ'!$A$10:$A$1002)=YEAR(PL!I$4)),'CASH&MJ'!$H$10:$H$1002)","v":0},{"$f":"SUMPRODUCT((BANK!$F$10:$F$1447=$B7)*(MONTH(BANK!$A$10:$A$1447)=MONTH(PL!J$4))*(YEAR(BANK!$A$10:$A$1447)=YEAR(PL!J$4)),BANK!$H$10:$H$1447)+SUMPRODUCT(('CASH&MJ'!$F$10:$F$1002=$B7)*(MONTH('CASH&MJ'!$A$10:$A$1002)=MONTH(PL!J$4))*(YEAR('CASH&MJ'!$A$10:$A$1002)=YEAR(PL!J$4)),'CASH&MJ'!$H$10:$H$1002)","v":0},{"$f":"SUMPRODUCT((BANK!$F$10:$F$1447=$B7)*(MONTH(BANK!$A$10:$A$1447)=MONTH(PL!K$4))*(YEAR(BANK!$A$10:$A$1447)=YEAR(PL!K$4)),BANK!$H$10:$H$1447)+SUMPRODUCT(('CASH&MJ'!$F$10:$F$1002=$B7)*(MONTH('CASH&MJ'!$A$10:$A$1002)=MONTH(PL!K$4))*(YEAR('CASH&MJ'!$A$10:$A$1002)=YEAR(PL!K$4)),'CASH&MJ'!$H$10:$H$1002)","v":0},{"$f":"SUMPRODUCT((BANK!$F$10:$F$1447=$B7)*(MONTH(BANK!$A$10:$A$1447)=MONTH(PL!L$4))*(YEAR(BANK!$A$10:$A$1447)=YEAR(PL!L$4)),BANK!$H$10:$H$1447)+SUMPRODUCT(('CASH&MJ'!$F$10:$F$1002=$B7)*(MONTH('CASH&MJ'!$A$10:$A$1002)=MONTH(PL!L$4))*(YEAR('CASH&MJ'!$A$10:$A$1002)=YEAR(PL!L$4)),'CASH&MJ'!$H$10:$H$1002)","v":0},{"$f":"SUMPRODUCT((BANK!$F$10:$F$1447=$B7)*(MONTH(BANK!$A$10:$A$1447)=MONTH(PL!M$4))*(YEAR(BANK!$A$10:$A$1447)=YEAR(PL!M$4)),BANK!$H$10:$H$1447)+SUMPRODUCT(('CASH&MJ'!$F$10:$F$1002=$B7)*(MONTH('CASH&MJ'!$A$10:$A$1002)=MONTH(PL!M$4))*(YEAR('CASH&MJ'!$A$10:$A$1002)=YEAR(PL!M$4)),'CASH&MJ'!$H$10:$H$1002)","v":0},{"$f":"SUMPRODUCT((BANK!$F$10:$F$1447=$B7)*(MONTH(BANK!$A$10:$A$1447)=MONTH(PL!N$4))*(YEAR(BANK!$A$10:$A$1447)=YEAR(PL!N$4)),BANK!$H$10:$H$1447)+SUMPRODUCT(('CASH&MJ'!$F$10:$F$1002=$B7)*(MONTH('CASH&MJ'!$A$10:$A$1002)=MONTH(PL!N$4))*(YEAR('CASH&MJ'!$A$10:$A$1002)=YEAR(PL!N$4)),'CASH&MJ'!$H$10:$H$1002)","v":0},{"$f":"SUMPRODUCT((BANK!$F$10:$F$1447=$B7)*(MONTH(BANK!$A$10:$A$1447)=MONTH(PL!O$4))*(YEAR(BANK!$A$10:$A$1447)=YEAR(PL!O$4)),BANK!$H$10:$H$1447)+SUMPRODUCT(('CASH&MJ'!$F$10:$F$1002=$B7)*(MONTH('CASH&MJ'!$A$10:$A$1002)=MONTH(PL!O$4))*(YEAR('CASH&MJ'!$A$10:$A$1002)=YEAR(PL!O$4)),'CASH&MJ'!$H$10:$H$1002)","v":0},null,{"$f":"C7-SETUP!D13","v":0}]
[null,{"$f":"SETUP!B14","v":"Other Income"},{"$f":"SUM(D8:O8)","v":0},{"$f":"SUMPRODUCT((BANK!$F$10:$F$1447=$B8)*(MONTH(BANK!$A$10:$A$1447)=MONTH(PL!D$4))*(YEAR(BANK!$A$10:$A$1447)=YEAR(PL!D$4)),BANK!$H$10:$H$1447)+SUMPRODUCT(('CASH&MJ'!$F$10:$F$1002=$B8)*(MONTH('CASH&MJ'!$A$10:$A$1002)=MONTH(PL!D$4))*(YEAR('CASH&MJ'!$A$10:$A$1002)=YEAR(PL!D$4)),'CASH&MJ'!$H$10:$H$1002)","v":0},{"$f":"SUMPRODUCT((BANK!$F$10:$F$1447=$B8)*(MONTH(BANK!$A$10:$A$1447)=MONTH(PL!E$4))*(YEAR(BANK!$A$10:$A$1447)=YEAR(PL!E$4)),BANK!$H$10:$H$1447)+SUMPRODUCT(('CASH&MJ'!$F$10:$F$1002=$B8)*(MONTH('CASH&MJ'!$A$10:$A$1002)=MONTH(PL!E$4))*(YEAR('CASH&MJ'!$A$10:$A$1002)=YEAR(PL!E$4)),'CASH&MJ'!$H$10:$H$1002)","v":0},{"$f":"SUMPRODUCT((BANK!$F$10:$F$1447=$B8)*(MONTH(BANK!$A$10:$A$1447)=MONTH(PL!F$4))*(YEAR(BANK!$A$10:$A$1447)=YEAR(PL!F$4)),BANK!$H$10:$H$1447)+SUMPRODUCT(('CASH&MJ'!$F$10:$F$1002=$B8)*(MONTH('CASH&MJ'!$A$10:$A$1002)=MONTH(PL!F$4))*(YEAR('CASH&MJ'!$A$10:$A$1002)=YEAR(PL!F$4)),'CASH&MJ'!$H$10:$H$1002)","v":0},{"$f":"SUMPRODUCT((BANK!$F$10:$F$1447=$B8)*(MONTH(BANK!$A$10:$A$1447)=MONTH(PL!G$4))*(YEAR(BANK!$A$10:$A$1447)=YEAR(PL!G$4)),BANK!$H$10:$H$1447)+SUMPRODUCT(('CASH&MJ'!$F$10:$F$1002=$B8)*(MONTH('CASH&MJ'!$A$10:$A$1002)=MONTH(PL!G$4))*(YEAR('CASH&MJ'!$A$10:$A$1002)=YEAR(PL!G$4)),'CASH&MJ'!$H$10:$H$1002)","v":0},{"$f":"SUMPRODUCT((BANK!$F$10:$F$1447=$B8)*(MONTH(BANK!$A$10:$A$1447)=MONTH(PL!H$4))*(YEAR(BANK!$A$10:$A$1447)=YEAR(PL!H$4)),BANK!$H$10:$H$1447)+SUMPRODUCT(('CASH&MJ'!$F$10:$F$1002=$B8)*(MONTH('CASH&MJ'!$A$10:$A$1002)=MONTH(PL!H$4))*(YEAR('CASH&MJ'!$A$10:$A$1002)=YEAR(PL!H$4)),'CASH&MJ'!$H$10:$H$1002)","v":0},{"$f":"SUMPRODUCT((BANK!$F$10:$F$1447=$B8)*(MONTH(BANK!$A$10:$A$1447)=MONTH(PL!I$4))*(YEAR(BANK!$A$10:$A$1447)=YEAR(PL!I$4)),BANK!$H$10:$H$1447)+SUMPRODUCT(('CASH&MJ'!$F$10:$F$1002=$B8)*(MONTH('CASH&MJ'!$A$10:$A$1002)=MONTH(PL!I$4))*(YEAR('CASH&MJ'!$A$10:$A$1002)=YEAR(PL!I$4)),'CASH&MJ'!$H$10:$H$1002)","v":0},{"$f":"SUMPRODUCT((BANK!$F$10:$F$1447=$B8)*(MONTH(BANK!$A$10:$A$1447)=MONTH(PL!J$4))*(YEAR(BANK!$A$10:$A$1447)=YEAR(PL!J$4)),BANK!$H$10:$H$1447)+SUMPRODUCT(('CASH&MJ'!$F$10:$F$1002=$B8)*(MONTH('CASH&MJ'!$A$10:$A$1002)=MONTH(PL!J$4))*(YEAR('CASH&MJ'!$A$10:$A$1002)=YEAR(PL!J$4)),'CASH&MJ'!$H$10:$H$1002)","v":0},{"$f":"SUMPRODUCT((BANK!$F$10:$F$1447=$B8)*(MONTH(BANK!$A$10:$A$1447)=MONTH(PL!K$4))*(YEAR(BANK!$A$10:$A$1447)=YEAR(PL!K$4)),BANK!$H$10:$H$1447)+SUMPRODUCT(('CASH&MJ'!$F$10:$F$1002=$B8)*(MONTH('CASH&MJ'!$A$10:$A$1002)=MONTH(PL!K$4))*(YEAR('CASH&MJ'!$A$10:$A$1002)=YEAR(PL!K$4)),'CASH&MJ'!$H$10:$H$1002)","v":0},{"$f":"SUMPRODUCT((BANK!$F$10:$F$1447=$B8)*(MONTH(BANK!$A$10:$A$1447)=MONTH(PL!L$4))*(YEAR(BANK!$A$10:$A$1447)=YEAR(PL!L$4)),BANK!$H$10:$H$1447)+SUMPRODUCT(('CASH&MJ'!$F$10:$F$1002=$B8)*(MONTH('CASH&MJ'!$A$10:$A$1002)=MONTH(PL!L$4))*(YEAR('CASH&MJ'!$A$10:$A$1002)=YEAR(PL!L$4)),'CASH&MJ'!$H$10:$H$1002)","v":0},{"$f":"SUMPRODUCT((BANK!$F$10:$F$1447=$B8)*(MONTH(BANK!$A$10:$A$1447)=MONTH(PL!M$4))*(YEAR(BANK!$A$10:$A$1447)=YEAR(PL!M$4)),BANK!$H$10:$H$1447)+SUMPRODUCT(('CASH&MJ'!$F$10:$F$1002=$B8)*(MONTH('CASH&MJ'!$A$10:$A$1002)=MONTH(PL!M$4))*(YEAR('CASH&MJ'!$A$10:$A$1002)=YEAR(PL!M$4)),'CASH&MJ'!$H$10:$H$1002)","v":0},{"$f":"SUMPRODUCT((BANK!$F$10:$F$1447=$B8)*(MONTH(BANK!$A$10:$A$1447)=MONTH(PL!N$4))*(YEAR(BANK!$A$10:$A$1447)=YEAR(PL!N$4)),BANK!$H$10:$H$1447)+SUMPRODUCT(('CASH&MJ'!$F$10:$F$1002=$B8)*(MONTH('CASH&MJ'!$A$10:$A$1002)=MONTH(PL!N$4))*(YEAR('CASH&MJ'!$A$10:$A$1002)=YEAR(PL!N$4)),'CASH&MJ'!$H$10:$H$1002)","v":0},{"$f":"SUMPRODUCT((BANK!$F$10:$F$1447=$B8)*(MONTH(BANK!$A$10:$A$1447)=MONTH(PL!O$4))*(YEAR(BANK!$A$10:$A$1447)=YEAR(PL!O$4)),BANK!$H$10:$H$1447)+SUMPRODUCT(('CASH&MJ'!$F$10:$F$1002=$B8)*(MONTH('CASH&MJ'!$A$10:$A$1002)=MONTH(PL!O$4))*(YEAR('CASH&MJ'!$A$10:$A$1002)=YEAR(PL!O$4)),'CASH&MJ'!$H$10:$H$1002)","v":0},null,{"$f":"C8-SETUP!D14","v":0}]
{"$rows_left_out":26}
{"sheet":"BAS","index":5,"n_rows":37,"n_cols":11,"rows_kept":37,"cut":false,"hidden":false,"merged":[]}
[{"$f":"SETUP!B3","v":"ABC PTY LTD"}]
["BAS REPORT"]
["Cash Basis"]
[]
["Monthly","GST Collected","GST Paid","PAYG-W",null,"ATO Payment/Refund","Gross Wages",null,"Sales-Gross","Sales-Net","Purchase-Net"]
[{"$f":"BANK!E3","v":"2025-07-01"},{"$f":"SUMPRODUCT((MONTH(BANK!$A$10:$A$1443)=MONTH($A6))*(YEAR(BANK!$A$10:$A$1443)=YEAR($A6))*(BANK!$E$10:$E$1443=\"GC\"),BANK!$G$10:$G$1443)+SUMPRODUCT((MONTH('CASH&MJ'!$A$10:$A$998)=MONTH($A6))*(YEAR('CASH&MJ'!$A$10:$A$998)=YEAR($A6))*('CASH&MJ'!$E$10:$E$998=\"GC\"),'CASH&MJ'!$G$10:$G$998)","v":0},{"$f":"SUMPRODUCT((MONTH(BANK!$A$10:$A$1443)=MONTH($A6))*(YEAR(BANK!$A$10:$A$1443)=YEAR($A6))*(BANK!$E$10:$E$1443=\"GP\"),BANK!$G$10:$G$1443)+SUMPRODUCT((MONTH('CASH&MJ'!$A$10:$A$887)=MONTH($A6))*(YEAR('CASH&MJ'!$A$10:$A$887)=YEAR($A6))*('CASH&MJ'!$E$10:$E$887=\"GP\"),'CASH&MJ'!$G$10:$G$887)","v":0},{"$f":"SUMPRODUCT((MONTH(WAGES!$A$15:$A$1061)=MONTH($A6))*(YEAR(WAGES!$A$15:$A$1061)=YEAR($A6)),WAGES!$D$15:$D$1061)","v":0},null,{"$f":"SUMPRODUCT((BANK!$F$10:$F$1443=SETUP!$B$36)*(MONTH(BANK!$A$10:$A$1443)=MONTH($A6))*(YEAR(BANK!$A$10:$A$1443)=YEAR($A6)),BANK!$H$10:$H$1443)+SUMPRODUCT(('CASH&MJ'!$F$10:$F$1432=SETUP!$B$36)*(MONTH('CASH&MJ'!$A$10:$A$1432)=MONTH($A6))*(YEAR('CASH&MJ'!$A$10:$A$1432)=YEAR($A6)),'CASH&MJ'!$H$10:$H$1432)","v":0},{"$f":"SUMPRODUCT((MONTH(WAGES!$A$15:$A$1061)=MONTH($A6))*(YEAR(WAGES!$A$15:$A$1061)=YEAR($A6)),WAGES!$C$15:$C$1061)","v":0},null,{"$f":"SUMPRODUCT((MONTH(BANK!$A$10:$A$1443)=MONTH($A6))*(YEAR(BANK!$A$10:$A$1443)=YEAR($A6))*(BANK!$E$10:$E$1443=\"GC\"),BANK!$I$10:$I$1443)+SUMPRODUCT((MONTH('CASH&MJ'!$A$10:$A$998)=MONTH($A6))*(YEAR('CASH&MJ'!$A$10:$A$998)=YEAR($A6))*('CASH&MJ'!$E$10:$E$998=\"GC\"),'CASH&MJ'!$I$10:$I$998)","v":0},{"$f":"SUMPRODUCT((MONTH(BANK!$A$10:$A$1443)=MONTH($A6))*(YEAR(BANK!$A$10:$A$1443)=YEAR($A6))*(BANK!$E$10:$E$1443=\"GC\"),BANK!$H$10:$H$1443)+SUMPRODUCT((MONTH('CASH&MJ'!$A$10:$A$998)=MONTH($A6))*(YEAR('CASH&MJ'!$A$10:$A$998)=YEAR($A6))*('CASH&MJ'!$E$10:$E$998=\"GC\"),'CASH&MJ'!$H$10:$H$998)","v":0},{"$f":"SUMPRODUCT((MONTH(BANK!$A$10:$A$1443)=MONTH($A6))*(YEAR(BANK!$A$10:$A$1443)=YEAR($A6))*(BANK!$E$10:$E$1443=\"GP\"),BANK!$H$10:$H$1443)+SUMPRODUCT((MONTH('CASH&MJ'!$A$10:$A$998)=MONTH($A6))*(YEAR('CASH&MJ'!$A$10:$A$998)=YEAR($A6))*('CASH&MJ'!$E$10:$E$998=\"GP\"),'CASH&MJ'!$H$10:$H$998)","v":0}]
[{"$f":"A6+31","v":"2025-08-01"},{"$f":"SUMPRODUCT((MONTH(BANK!$A$10:$A$1443)=MONTH($A7))*(YEAR(BANK!$A$10:$A$1443)=YEAR($A7))*(BANK!$E$10:$E$1443=\"GC\"),BANK!$G$10:$G$1443)+SUMPRODUCT((MONTH('CASH&MJ'!$A$10:$A$998)=MONTH($A7))*(YEAR('CASH&MJ'!$A$10:$A$998)=YEAR($A7))*('CASH&MJ'!$E$10:$E$998=\"GC\"),'CASH&MJ'!$G$10:$G$998)","v":0},{"$f":"SUMPRODUCT((MONTH(BANK!$A$10:$A$1443)=MONTH($A7))*(YEAR(BANK!$A$10:$A$1443)=YEAR($A7))*(BANK!$E$10:$E$1443=\"GP\"),BANK!$G$10:$G$1443)+SUMPRODUCT((MONTH('CASH&MJ'!$A$10:$A$887)=MONTH($A7))*(YEAR('CASH&MJ'!$A$10:$A$887)=YEAR($A7))*('CASH&MJ'!$E$10:$E$887=\"GP\"),'CASH&MJ'!$G$10:$G$887)","v":0},{"$f":"SUMPRODUCT((MONTH(WAGES!$A$15:$A$1061)=MONTH($A7))*(YEAR(WAGES!$A$15:$A$1061)=YEAR($A7)),WAGES!$D$15:$D$1061)","v":0},null,{"$f":"SUMPRODUCT((BANK!$F$10:$F$1443=SETUP!$B$36)*(MONTH(BANK!$A$10:$A$1443)=MONTH($A7))*(YEAR(BANK!$A$10:$A$1443)=YEAR($A7)),BANK!$H$10:$H$1443)+SUMPRODUCT(('CASH&MJ'!$F$10:$F$1432=SETUP!$B$36)*(MONTH('CASH&MJ'!$A$10:$A$1432)=MONTH($A7))*(YEAR('CASH&MJ'!$A$10:$A$1432)=YEAR($A7)),'CASH&MJ'!$H$10:$H$1432)","v":0},{"$f":"SUMPRODUCT((MONTH(WAGES!$A$15:$A$1061)=MONTH($A7))*(YEAR(WAGES!$A$15:$A$1061)=YEAR($A7)),WAGES!$C$15:$C$1061)","v":0},null,{"$f":"SUMPRODUCT((MONTH(BANK!$A$10:$A$1443)=MONTH($A7))*(YEAR(BANK!$A$10:$A$1443)=YEAR($A7))*(BANK!$E$10:$E$1443=\"GC\"),BANK!$I$10:$I$1443)+SUMPRODUCT((MONTH('CASH&MJ'!$A$10:$A$998)=MONTH($A7))*(YEAR('CASH&MJ'!$A$10:$A$998)=YEAR($A7))*('CASH&MJ'!$E$10:$E$998=\"GC\"),'CASH&MJ'!$I$10:$I$998)","v":0},{"$f":"SUMPRODUCT((MONTH(BANK!$A$10:$A$1443)=MONTH($A7))*(YEAR(BANK!$A$10:$A$1443)=YEAR($A7))*(BANK!$E$10:$E$1443=\"GC\"),BANK!$H$10:$H$1443)+SUMPRODUCT((MONTH('CASH&MJ'!$A$10:$A$998)=MONTH($A7))*(YEAR('CASH&MJ'!$A$10:$A$998)=YEAR($A7))*('CASH&MJ'!$E$10:$E$998=\"GC\"),'CASH&MJ'!$H$10:$H$998)","v":0},{"$f":"SUMPRODUCT((MONTH(BANK!$A$10:$A$1443)=MONTH($A7))*(YEAR(BANK!$A$10:$A$1443)=YEAR($A7))*(BANK!$E$10:$E$1443=\"GP\"),BANK!$H$10:$H$1443)+SUMPRODUCT((MONTH('CASH&MJ'!$A$10:$A$998)=MONTH($A7))*(YEAR('CASH&MJ'!$A$10:$A$998)=YEAR($A7))*('CASH&MJ'!$E$10:$E$998=\"GP\"),'CASH&MJ'!$H$10:$H$998)","v":0}]
["2025-09-01",{"$f":"SUMPRODUCT((MONTH(BANK!$A$10:$A$1443)=MONTH($A8))*(YEAR(BANK!$A$10:$A$1443)=YEAR($A8))*(BANK!$E$10:$E$1443=\"GC\"),BANK!$G$10:$G$1443)+SUMPRODUCT((MONTH('CASH&MJ'!$A$10:$A$998)=MONTH($A8))*(YEAR('CASH&MJ'!$A$10:$A$998)=YEAR($A8))*('CASH&MJ'!$E$10:$E$998=\"GC\"),'CASH&MJ'!$G$10:$G$998)","v":0},{"$f":"SUMPRODUCT((MONTH(BANK!$A$10:$A$1443)=MONTH($A8))*(YEAR(BANK!$A$10:$A$1443)=YEAR($A8))*(BANK!$E$10:$E$1443=\"GP\"),BANK!$G$10:$G$1443)+SUMPRODUCT((MONTH('CASH&MJ'!$A$10:$A$887)=MONTH($A8))*(YEAR('CASH&MJ'!$A$10:$A$887)=YEAR($A8))*('CASH&MJ'!$E$10:$E$887=\"GP\"),'CASH&MJ'!$G$10:$G$887)","v":0},{"$f":"SUMPRODUCT((MONTH(WAGES!$A$15:$A$1061)=MONTH($A8))*(YEAR(WAGES!$A$15:$A$1061)=YEAR($A8)),WAGES!$D$15:$D$1061)","v":0},null,{"$f":"SUMPRODUCT((BANK!$F$10:$F$1443=SETUP!$B$36)*(MONTH(BANK!$A$10:$A$1443)=MONTH($A8))*(YEAR(BANK!$A$10:$A$1443)=YEAR($A8)),BANK!$H$10:$H$1443)+SUMPRODUCT(('CASH&MJ'!$F$10:$F$1432=SETUP!$B$36)*(MONTH('CASH&MJ'!$A$10:$A$1432)=MONTH($A8))*(YEAR('CASH&MJ'!$A$10:$A$1432)=YEAR($A8)),'CASH&MJ'!$H$10:$H$1432)","v":0},{"$f":"SUMPRODUCT((MONTH(WAGES!$A$15:$A$1061)=MONTH($A8))*(YEAR(WAGES!$A$15:$A$1061)=YEAR($A8)),WAGES!$C$15:$C$1061)","v":0},null,{"$f":"SUMPRODUCT((MONTH(BANK!$A$10:$A$1443)=MONTH($A8))*(YEAR(BANK!$A$10:$A$1443)=YEAR($A8))*(BANK!$E$10:$E$1443=\"GC\"),BANK!$I$10:$I$1443)+SUMPRODUCT((MONTH('CASH&MJ'!$A$10:$A$998)=MONTH($A8))*(YEAR('CASH&MJ'!$A$10:$A$998)=YEAR($A8))*('CASH&MJ'!$E$10:$E$998=\"GC\"),'CASH&MJ'!$I$10:$I$998)","v":0},{"$f":"SUMPRODUCT((MONTH(BANK!$A$10:$A$1443)=MONTH($A8))*(YEAR(BANK!$A$10:$A$1443)=YEAR($A8))*(BANK!$E$10:$E$1443=\"GC\"),BANK!$H$10:$H$1443)+SUMPRODUCT((MONTH('CASH&MJ'!$A$10:$A$998)=MONTH($A8))*(YEAR('CASH&MJ'!$A$10:$A$998)=YEAR($A8))*('CASH&MJ'!$E$10:$E$998=\"GC\"),'CASH&MJ'!$H$10:$H$998)","v":0},{"$f":"SUMPRODUCT((MONTH(BANK!$A$10:$A$1443)=MONTH($A8))*(YEAR(BANK!$A$10:$A$1443)=YEAR($A8))*(BANK!$E$10:$E$1443=\"GP\"),BANK!$H$10:$H$1443)+SUMPRODUCT((MONTH('CASH&MJ'!$A$10:$A$998)=MONTH($A8))*(YEAR('CASH&MJ'!$A$10:$A$998)=YEAR($A8))*('CASH&MJ'!$E$10:$E$998=\"GP\"),'CASH&MJ'!$H$10:$H$998)","v":0}]
{"$rows_left_out":30}
{"sheet":"BS","index":6,"n_rows":38,"n_cols":8,"rows_kept":38,"cut":false,"hidden":true,"merged":[]}
[null,{"$f":"SETUP!B3","v":"ABC PTY LTD"}]
[null,"Balance Sheet"]
[]
["Cash Basis",null,null,"FY2025",null,"FY2024",null,"Movements"]
[null,"ASSETS"]
[null,"Current Assets"]
[{"$f":"VLOOKUP(B7,SETUP!B:C,2,0)","v":0},{"$f":"SETUP!B44","v":"Bank Account"}]
[null,{"$f":"SETUP!B45","v":"Cash On Hand"}]
{"$rows_left_out":30}